Target
Mitogen-activated protein kinase 1
Ligand
BDBM418308
Substrate
Meas. Tech.
ERK2 In vitro Inhibition Assay
IC50
1.60±n/a nM
Citation
 Berdini, VBuck, IMDay, JEGriffiths-Jones, CMHeightman, TDHoward, SMurray, CWNorton, DO''Reilly, MWoolford, AJCooke, MLCousin, DOnions, STShannon, JMWatts, JP Benzolactam compounds as protein kinase inhibitors US Patent  US11001575 Publication Date 5/11/2021 
Target
Name:
Mitogen-activated protein kinase 1
Synonyms:
ERK2 Extracellular signal-regulated kinase 2 Extracellular signal-regulated kinase 2 (ERK2) MAPK 2 MK01_HUMAN Mitogen-activated protein kinase 1 (ERK-2) Mitogen-activated protein kinase 2 PRKM2 | p42-MAPK
Type:
Ser/Thr Protein Kinase
Mol. Mass.:
41392.76
Organism:
Homo sapiens (Human)
Description:
P28482
Residue:
360
  
Inhibitor
Name:
BDBM418308
Synonyms:
(2R)-2-[6-(5-chloro-2-{[cis-3- methoxycyclobutyl]amino}pyrimidin-4- yl)-1-oxo-2,3-dihydro-1H-isoindol-2- yl]-N-[(1S)-1-(3-fluoro-5- methoxyphenyl)-2- hydroxyethyl]propanamide US11001575, Example 1115
Type:
Small organic molecule
Emp. Form.:
C29H31ClFN5O5
Mol. Mass.:
584.038
SMILES:
CO[C@@H]1C[C@@H](C1)Nc1ncc(Cl)c(n1)-c1ccc2CN([C@H](C)C(=O)N[C@H](CO)c3cc(F)cc(OC)c3)C(=O)c2c1
: