Target
Tyrosine-protein kinase receptor TYRO3
Ligand
BDBM497310
Substrate
Meas. Tech.
Activity Assay
IC50
275±n/a nM
Citation
 Wang, XZheng, HZhao, JZhang, WFrye, SV Alkyl pyrrolopyrimidine analogs and methods of making and using same US Patent  US11001586 Publication Date 5/11/2021 
Target
Name:
Tyrosine-protein kinase receptor TYRO3
Synonyms:
BYK RSE TIF TYRO3_HUMAN | Tyrosine-protein kinase SKY
Type:
Protein
Mol. Mass.:
96894.13
Organism:
Homo sapiens (Human)
Description:
Q06418
Residue:
890
  
Inhibitor
Name:
BDBM497310
Synonyms:
(4-(7-((1r,4S)-4- (difluoromethyl)cyclohexyl)- 2-(((S)-pentan-2- yl)amino)-7H-pyrrolo[2,3- d]pyrimidin-5-yl)piperidin- 1-yl)(2,6-dimethylpyridin- 4-yl)methanone | US11001586, Example 88
Type:
Small organic molecule
Emp. Form.:
C31H42F2N6O
Mol. Mass.:
552.7016
SMILES:
CCC[C@H](C)Nc1ncc2c(cn([C@H]3CC[C@@H](CC3)C(F)F)c2n1)C1CCN(CC1)C(=O)c1cc(C)nc(C)c1
: