Target
Beta-secretase 2
Ligand
BDBM448208
Substrate
Meas. Tech.
Time-Resolved Endpoint Proteolysis Assay
Ki
96.3±n/a nM
Citation
 Wu, WCumming, JNTaoka, BMDai, X C5-C6-oxacyclic fused iminothiazine dioxide compounds bearing an ether linker as BACE inhibitors, compositions, and their use US Patent  US11008338 Publication Date 5/18/2021 
Target
Name:
Beta-secretase 2
Synonyms:
AEPLC ASP1 Asp 1 Aspartyl protease 1 BACE2_HUMAN Beta-secretase (BACE) Beta-secretase 2 (BACE-2) Beta-site APP-cleaving enzyme 2 Memapsin-1 beta-Secretase (BACE-2)
Type:
Protein
Mol. Mass.:
56171.20
Organism:
Homo sapiens (Human)
Description:
Q9Y5Z0
Residue:
518
  
Inhibitor
Name:
BDBM448208
Synonyms:
US10689401, EX 12 | US11008338, Example 12
Type:
Small organic molecule
Emp. Form.:
C22H24F2N2O4S
Mol. Mass.:
450.499
SMILES:
COc1ccc(F)c(c1)[C@]12CO[C@H](C[C@H]1S(=O)(=O)C(C)(C)C(=N)N2)c1ccc(F)cc1
: