Target
Sodium channel protein type 9 subunit alpha
Ligand
BDBM499341
Substrate
Meas. Tech.
EFS-FRET Assay
IC50
<500±n/a nM
Citation
 Kawamura, KYamagishi, TShishido, YMorita, MYamaguchi, ROhmi, M Biaryloxy derivatives as TTX-S blockers US Patent  US11020381 Publication Date 6/1/2021 
Target
Name:
Sodium channel protein type 9 subunit alpha
Synonyms:
NENA Peripheral sodium channel 1 SCN9A_HUMAN Voltage-gated sodium channel subunit Nav1.7 hNE-Na
Type:
Protein
Mol. Mass.:
226375.97
Organism:
Homo sapiens (Human)
Description:
Q15858
Residue:
1988
  
Inhibitor
Name:
BDBM499341
Synonyms:
4-((3-(6- (cyclopropylmethoxy)pyridin-3- yl)-5-fluorophenoxy)methyl)- 2,5-difluoro-N- (methylsulfonyl)benzamide | US11020381, Example 31
Type:
Small organic molecule
Emp. Form.:
C24H21F3N2O5S
Mol. Mass.:
506.494
SMILES:
CS(=O)(=O)NC(=O)c1cc(F)c(COc2cc(F)cc(c2)-c2ccc(OCC3CC3)nc2)cc1F
: