Target
Sodium channel protein type 9 subunit alpha
Ligand
BDBM499399
Substrate
Meas. Tech.
EFS-FRET Assay
IC50
<500±n/a nM
Citation
 Kawamura, KYamagishi, TShishido, YMorita, MYamaguchi, ROhmi, M Biaryloxy derivatives as TTX-S blockers US Patent  US11020381 Publication Date 6/1/2021 
Target
Name:
Sodium channel protein type 9 subunit alpha
Synonyms:
NENA Peripheral sodium channel 1 SCN9A_HUMAN Voltage-gated sodium channel subunit Nav1.7 hNE-Na
Type:
Protein
Mol. Mass.:
226375.97
Organism:
Homo sapiens (Human)
Description:
Q15858
Residue:
1988
  
Inhibitor
Name:
BDBM499399
Synonyms:
4-((3-(6-(cyclopropylmethoxy)- 4-methylpyridin-3-yl)-5- fluorophenoxy)methyl)-N- (methylsulfonyl)benzamide | US11020381, Example 95
Type:
Small organic molecule
Emp. Form.:
C25H25FN2O5S
Mol. Mass.:
484.54
SMILES:
Cc1cc(OCC2CC2)ncc1-c1cc(F)cc(OCc2ccc(cc2)C(=O)NS(C)(=O)=O)c1
: