Target
Sodium channel protein type 9 subunit alpha
Ligand
BDBM499432
Substrate
Meas. Tech.
EFS-FRET Assay
IC50
<500±n/a nM
Citation
 Kawamura, KYamagishi, TShishido, YMorita, MYamaguchi, ROhmi, M Biaryloxy derivatives as TTX-S blockers US Patent  US11020381 Publication Date 6/1/2021 
Target
Name:
Sodium channel protein type 9 subunit alpha
Synonyms:
NENA Peripheral sodium channel 1 SCN9A_HUMAN Voltage-gated sodium channel subunit Nav1.7 hNE-Na
Type:
Protein
Mol. Mass.:
226375.97
Organism:
Homo sapiens (Human)
Description:
Q15858
Residue:
1988
  
Inhibitor
Name:
BDBM499432
Synonyms:
4-((3-(4- (cyclopropylmethoxy)pyridin-2- yl)-5-fluorophenoxy)methyl)-N- (methylsulfonyl)benzamide | US11020381, Example 128
Type:
Small organic molecule
Emp. Form.:
C24H23FN2O5S
Mol. Mass.:
470.513
SMILES:
CS(=O)(=O)NC(=O)c1ccc(COc2cc(F)cc(c2)-c2cc(OCC3CC3)ccn2)cc1
: