Target
Sodium channel protein type 9 subunit alpha
Ligand
BDBM499453
Substrate
Meas. Tech.
EFS-FRET Assay
IC50
<500±n/a nM
Citation
 Kawamura, KYamagishi, TShishido, YMorita, MYamaguchi, ROhmi, M Biaryloxy derivatives as TTX-S blockers US Patent  US11020381 Publication Date 6/1/2021 
Target
Name:
Sodium channel protein type 9 subunit alpha
Synonyms:
NENA Peripheral sodium channel 1 SCN9A_HUMAN Voltage-gated sodium channel subunit Nav1.7 hNE-Na
Type:
Protein
Mol. Mass.:
226375.97
Organism:
Homo sapiens (Human)
Description:
Q15858
Residue:
1988
  
Inhibitor
Name:
BDBM499453
Synonyms:
4-((3-(6-(cyclopropylmethoxy)-5- methylpyrimidin-4-yl)-5- fluorophenoxy)methyl)-N- (methylsulfonyl)benzamide | US11020381, Example 150
Type:
Small organic molecule
Emp. Form.:
C24H24FN3O5S
Mol. Mass.:
485.528
SMILES:
Cc1c(OCC2CC2)ncnc1-c1cc(F)cc(OCc2ccc(cc2)C(=O)NS(C)(=O)=O)c1
: