Target
Xanthine dehydrogenase/oxidase
Ligand
BDBM499651
Substrate
Meas. Tech.
xanthine oxidase activity assay
IC50
0.280±n/a nM
Citation
 Warrell, Jr., RPPiwinski, JJLarivée, ASiddiqui, AThai, K Compounds and their use for reducing uric acid levels US Patent  US11020397 Publication Date 6/1/2021 
Target
Name:
Xanthine dehydrogenase/oxidase
Synonyms:
XD XDHA XO Xanthine dehydrogenase/oxidase | Xanthine oxidase
Type:
Enzyme
Mol. Mass.:
146441.21
Organism:
Homo sapiens (Human)
Description:
P47989
Residue:
1333
  
Inhibitor
Name:
BDBM499651
Synonyms:
US11020397, Compound Formula-(IIk)
Type:
Small organic molecule
Emp. Form.:
C14H12N6O3S
Mol. Mass.:
344.348
SMILES:
CSc1nc(O)c(C(=O)Nc2ccc(cc2)-c2nnc[nH]2)c(=O)[nH]1
: