Target
Xanthine dehydrogenase/oxidase
Ligand
BDBM499685
Substrate
Meas. Tech.
xanthine oxidase activity assay
IC50
0.520±n/a nM
Citation
 Warrell, Jr., RPPiwinski, JJLarivée, ASiddiqui, AThai, K Compounds and their use for reducing uric acid levels US Patent  US11020397 Publication Date 6/1/2021 
Target
Name:
Xanthine dehydrogenase/oxidase
Synonyms:
XD XDHA XO Xanthine dehydrogenase/oxidase | Xanthine oxidase
Type:
Enzyme
Mol. Mass.:
146441.21
Organism:
Homo sapiens (Human)
Description:
P47989
Residue:
1333
  
Inhibitor
Name:
BDBM499685
Synonyms:
US11020397, Compound Formula-(II9)
Type:
Small organic molecule
Emp. Form.:
C13H10FN7O3S
Mol. Mass.:
363.327
SMILES:
CSc1nc(O)c(C(=O)Nc2ncc(cc2F)-c2c[nH]nn2)c(=O)[nH]1
: