Target
Tyrosine-protein kinase BTK
Ligand
BDBM499757
Substrate
Meas. Tech.
Mobility Shift Assay (MSA) Type A
IC50
2.20±n/a nM
Citation
 Bates, CEathiraj, SInagaki, HLapierre, JMomose, TNakayama, KOdagiri, TOta, MOta, YShibata, YTandon, MTsunemi, T Amino-pyrrolopyrimidinone compounds and methods of use thereof US Patent  US11020398 Publication Date 6/1/2021 
Target
Name:
Tyrosine-protein kinase BTK
Synonyms:
AGMX1 Agammaglobulinaemia tyrosine kinase B cell progenitor kinase BPK BTK_HUMAN Tyrosine Kinase BTK Tyrosine-protein kinase BTK (BTK)
Type:
Enzyme
Mol. Mass.:
76289.95
Organism:
Homo sapiens (Human)
Description:
Q06187
Residue:
659
  
Inhibitor
Name:
BDBM499757
Synonyms:
(2-chlorophenyl)(4-((cis-4-(pyrrolidin- 1-yl)cyclohexyl)amino)-7H-pyrrolo[2,3- d]pyrimidin-5-yl)methanone | US11020398, Compound I-69
Type:
Small organic molecule
Emp. Form.:
C23H26ClN5O
Mol. Mass.:
423.938
SMILES:
Clc1ccccc1C(=O)c1c[nH]c2ncnc(N[C@H]3CC[C@H](CC3)N3CCCC3)c12
: