Target
Tyrosine-protein kinase BTK
Ligand
BDBM499865
Substrate
Meas. Tech.
Mobility Shift Assay (MSA) Type B
IC50
1.70±n/a nM
Citation
 Bates, CEathiraj, SInagaki, HLapierre, JMomose, TNakayama, KOdagiri, TOta, MOta, YShibata, YTandon, MTsunemi, T Amino-pyrrolopyrimidinone compounds and methods of use thereof US Patent  US11020398 Publication Date 6/1/2021 
Target
Name:
Tyrosine-protein kinase BTK
Synonyms:
AGMX1 Agammaglobulinaemia tyrosine kinase B cell progenitor kinase BPK BTK_HUMAN Tyrosine Kinase BTK Tyrosine-protein kinase BTK (BTK)
Type:
Enzyme
Mol. Mass.:
76289.95
Organism:
Homo sapiens (Human)
Description:
Q06187
Residue:
659
  
Inhibitor
Name:
BDBM499865
Synonyms:
(2-chloro-4-phenoxyphenyl)(4-((trans- 4-((dimethylamino)methyl)-4- hydroxycyclohexyl)amino)-7H- pyrrolo[2,3-d]pyrimidin-5-yl)methanone | US11020398, Compound I-177
Type:
Small organic molecule
Emp. Form.:
C28H30ClN5O3
Mol. Mass.:
520.023
SMILES:
CN(C)C[C@]1(O)CC[C@@H](CC1)Nc1ncnc2[nH]cc(C(=O)c3ccc(Oc4ccccc4)cc3Cl)c12
: