Target
Glutaminyl-peptide cyclotransferase
Ligand
BDBM7916
Substrate
BDBM7883
Meas. Tech.
QC Inhibition Testing
Ki
490±n/a nM
Citation
 Buchholz, MHeiser, USchilling, SNiestroj, AJZunkel, KDemuth, HU The first potent inhibitors for human glutaminyl cyclase: synthesis and structure-activity relationship. J Med Chem 49:664-77 (2006)  
Target
Name:
Glutaminyl-peptide cyclotransferase
Synonyms:
Glutaminyl Cyclase Glutaminyl-peptide cyclotransferase Glutaminyl-tRNA cyclotransferase QPCT | QPCT_HUMAN
Type:
Enzyme
Mol. Mass.:
40877.05
Organism:
Homo sapiens (Human)
Description:
Q16769
Residue:
361
  
Inhibitor
Name:
BDBM7916
Synonyms:
1-(3,4-dimethoxyphenyl)-3-[3-(1H-imidazol-1-yl)propyl]urea 1-alkylimidazole urea deriv. 51
Type:
Small organic molecule
Emp. Form.:
C15H20N4O3
Mol. Mass.:
304.3443
SMILES:
COc1ccc(NC(=O)NCCCn2ccnc2)cc1OC
:
Substrate
Name:
BDBM7883
Synonyms:
(2S)-2-amino-N-(4-methyl-2-oxo-2H-chromen-7-yl)pentanediamide L-glutaminyl-4-methylcoumarinylamide
Type:
Small organic molecule
Emp. Form.:
C15H17N3O4
Mol. Mass.:
303.3132
SMILES:
Cc1cc(=O)oc2cc(NC(=O)[C@@H](N)CCC(N)=O)ccc12
: