Target
Mitogen-activated protein kinase kinase kinase kinase 1
Ligand
BDBM500577
Substrate
Meas. Tech.
Biochemical Enzyme Assay
IC50
<100±n/a nM
Citation
 Kaila, NLinney, IWard, SWishart, GWhittaker, BCote, AGreenwood, JRLeffler, AAlbanese, SKSeverance, DL Substituted isoindolin-1-ones and 2,3-dihydro-1h-pyrrolo[3,4-c]pyridin-1-ones as HPK1 antagonists US Patent  US11021481 Publication Date 6/1/2021 
Target
Name:
Mitogen-activated protein kinase kinase kinase kinase 1
Synonyms:
HPK1 MAP4K1
Type:
PROTEIN
Mol. Mass.:
91316.07
Organism:
Homo sapiens (Human)
Description:
ChEMBL_586597
Residue:
833
  
Inhibitor
Name:
BDBM500577
Synonyms:
4-(7-chloroimidazo [1,2-a]pyridin- 3-yl)-7-[[6-(4- methylpiperazin- 1-yl)-2- pyridyl]amino] isoindolin-1-one US11078201, Compound I-236 | US11548890, Compound I-236
Type:
Small organic molecule
Emp. Form.:
C25H24ClN7O
Mol. Mass.:
473.957
SMILES:
CN1CCN(CC1)c1cccc(Nc2ccc(c3CNC(=O)c23)-c2cnc3cc(Cl)ccn23)n1
: