Target
Mitogen-activated protein kinase kinase kinase kinase 1
Ligand
BDBM500600
Substrate
Meas. Tech.
Biochemical Enzyme Assay
IC50
<100±n/a nM
Citation
 Kaila, NLinney, IWard, SWishart, GWhittaker, BCote, AGreenwood, JRLeffler, AAlbanese, SKSeverance, DL Substituted isoindolin-1-ones and 2,3-dihydro-1h-pyrrolo[3,4-c]pyridin-1-ones as HPK1 antagonists US Patent  US11021481 Publication Date 6/1/2021 
Target
Name:
Mitogen-activated protein kinase kinase kinase kinase 1
Synonyms:
HPK1 MAP4K1
Type:
PROTEIN
Mol. Mass.:
91316.07
Organism:
Homo sapiens (Human)
Description:
ChEMBL_586597
Residue:
833
  
Inhibitor
Name:
BDBM500600
Synonyms:
(R)-4-(6- methyl-6,7- dihydro-5H- pyrazolo[5,1- b][1,3]oxazin- 3-yl)-7-((5-(4- methylpiperazin- 1-yl)pyridin-2- yl)amino)isoin- dolin-1-one US11021481, Compound I-261 US11548890, Compound I-261
Type:
Small organic molecule
Emp. Form.:
C25H29N7O2
Mol. Mass.:
459.5435
SMILES:
C[C@@H]1COc2c(cnn2C1)-c1ccc(Nc2ccc(cn2)N2CCN(C)CC2)c2C(=O)NCc12
: