Target
Sodium channel protein type 9 subunit alpha
Ligand
BDBM501923
Substrate
Meas. Tech.
Electrophysiological Assay (EP) (In Vitro Assay)
IC50
0.528±n/a nM
Citation
 Sutherlin, DMcKerrall, SLai, KWLiu, ZLiu, WBeveridge, RLeclerc, JLemire, AZhao, LSturino, C Therapeutic compounds and methods of use thereof US Patent  US11028075 Publication Date 6/8/2021 
Target
Name:
Sodium channel protein type 9 subunit alpha
Synonyms:
NENA Peripheral sodium channel 1 SCN9A_HUMAN Voltage-gated sodium channel subunit Nav1.7 hNE-Na
Type:
Protein
Mol. Mass.:
226375.97
Organism:
Homo sapiens (Human)
Description:
Q15858
Residue:
1988
  
Inhibitor
Name:
BDBM501923
Synonyms:
US11028075, Example 56
Type:
Small organic molecule
Emp. Form.:
C25H25BrF4N4O3S
Mol. Mass.:
617.454
SMILES:
CN(C)[C@H]1C[C@H](CC[C@@H]1Oc1cc(F)c(cc1Br)S(=O)(=O)Nc1ccncn1)c1cccc(c1)C(F)(F)F
: