Target
Mitogen-activated protein kinase kinase kinase kinase 1
Ligand
BDBM500900
Substrate
Meas. Tech.
Biochemical Enzyme Assay
IC50
<100±n/a nM
Citation
 Kaila, NLinney, IWard, SWishart, GWhittaker, BCote, AGreenwood, JRLeffler, AAlbanese, SKSeverance, DL Substituted isoindolin-1-ones and 2,3-dihydro-1h-pyrrolo[3,4-c]pyridin-1-ones as hpk1 antagonists US Patent  US11028085 Publication Date 6/8/2021 
Target
Name:
Mitogen-activated protein kinase kinase kinase kinase 1
Synonyms:
HPK1 MAP4K1
Type:
PROTEIN
Mol. Mass.:
91316.07
Organism:
Homo sapiens (Human)
Description:
ChEMBL_586597
Residue:
833
  
Inhibitor
Name:
BDBM500900
Synonyms:
7-((5-(2-(2- (dimethylami- no)propan-2- yl)morpholino )pyridin-2- yl)amino)-4- (7-fluoroimidazo [1,2-a]pyridin- 3-yl)isoindolin- 1-one US11078201, Compound I-564 | US11548890, Compound I-564
Type:
Small organic molecule
Emp. Form.:
C29H32FN7O2
Mol. Mass.:
529.6085
SMILES:
CN(C)C(C)(C)C1CN(CCO1)c1ccc(Nc2ccc(c3CNC(=O)c23)-c2cnc3cc(F)ccn23)nc1
: