Target
Sphingosine 1-phosphate receptor 3
Ligand
BDBM399214
Substrate
Meas. Tech.
Competition Binding Assay
IC50
22.0±n/a nM
Citation
 Roberts, ERosen, HUrbano, MGuerrero, M Sphinogosine-1 -phosphate receptor modulators for treatment of cardiopulmonary disorders US Patent  US11034691 Publication Date 6/15/2021 
Target
Name:
Sphingosine 1-phosphate receptor 3
Synonyms:
C9orf108 EDG3 S1P receptor 3 S1P3 S1PR3_HUMAN Sphingosine 1-phosphate receptor 3 (S1P3) | Sphingosine 1-phosphate receptor Edg-3
Type:
G Protein-Coupled Receptor (GPCR)
Mol. Mass.:
42278.13
Organism:
Homo sapiens (Human)
Description:
Q99500
Residue:
378
  
Inhibitor
Name:
BDBM399214
Synonyms:
US10323029, Generic formula 52464 IB | US11034691, CYM generic formula 52464 IB
Type:
Small organic molecule
Emp. Form.:
C20H11Cl4N3O
Mol. Mass.:
451.133
SMILES:
Clc1ccc(nc1)[C@@H](NC(=O)c1ccc(C#N)c(Cl)c1)c1ccc(Cl)c(Cl)c1
: