Target
Sphingosine 1-phosphate receptor 3
Ligand
BDBM399364
Substrate
Meas. Tech.
Competition Binding Assay
IC50
37.0±n/a nM
Citation
 Roberts, ERosen, HUrbano, MGuerrero, M Sphinogosine-1 -phosphate receptor modulators for treatment of cardiopulmonary disorders US Patent  US11034691 Publication Date 6/15/2021 
Target
Name:
Sphingosine 1-phosphate receptor 3
Synonyms:
C9orf108 EDG3 S1P receptor 3 S1P3 S1PR3_HUMAN Sphingosine 1-phosphate receptor 3 (S1P3) | Sphingosine 1-phosphate receptor Edg-3
Type:
G Protein-Coupled Receptor (GPCR)
Mol. Mass.:
42278.13
Organism:
Homo sapiens (Human)
Description:
Q99500
Residue:
378
  
Inhibitor
Name:
BDBM399364
Synonyms:
US10323029, Generic formula 52680 | US11034691, CYM generic formula 52680 IA
Type:
Small organic molecule
Emp. Form.:
C23H15Cl2FN2O
Mol. Mass.:
425.282
SMILES:
Fc1cc(ccc1C#N)C(=O)NC(c1ccc(Cl)cc1)c1ccc(Cl)cc1C=C
: