Target
Mitogen-activated protein kinase kinase kinase kinase 1
Ligand
BDBM501064
Substrate
Meas. Tech.
Biochemical Enzyme Assay
IC50
<100±n/a nM
Citation
 Kaila, NLinney, IWard, SWishart, GWhittaker, BCote, AGreenwood, JRLeffler, AAlbanese, SKSeverance, DL Substituted isoindolin-1-ones and 2,3-dihydro-1H-pyrrolo[3,4-c]pyridin-1-ones as HPK1 antagonists US Patent  US11034694 Publication Date 6/15/2021 
Target
Name:
Mitogen-activated protein kinase kinase kinase kinase 1
Synonyms:
HPK1 MAP4K1
Type:
PROTEIN
Mol. Mass.:
91316.07
Organism:
Homo sapiens (Human)
Description:
ChEMBL_586597
Residue:
833
  
Inhibitor
Name:
BDBM501064
Synonyms:
4-(7- fluoroimidazo [1,2-a]pyridin- 3-yl)-7-(6-(((S)-3- fluoropyrrolidi n-1-yl)methyl)-5- ((R)-tetrahydro- fura- n-3-yl)pyridin-2- yl)amino)isoin- dolin-1-one US11078201, Compound I-736 | US11548890, Compound I-736
Type:
Small organic molecule
Emp. Form.:
C29H28F2N6O2
Mol. Mass.:
530.5684
SMILES:
F[C@H]1CCN(Cc2nc(Nc3ccc(c4CNC(=O)c34)-c3cnc4cc(F)ccn34)ccc2[C@@H]2CCOC2)C1
: