Target
Mitogen-activated protein kinase kinase kinase kinase 1
Ligand
BDBM501096
Substrate
Meas. Tech.
Biochemical Enzyme Assay
IC50
<100±n/a nM
Citation
 Kaila, NLinney, IWard, SWishart, GWhittaker, BCote, AGreenwood, JRLeffler, AAlbanese, SKSeverance, DL Substituted isoindolin-1-ones and 2,3-dihydro-1H-pyrrolo[3,4-c]pyridin-1-ones as HPK1 antagonists US Patent  US11034694 Publication Date 6/15/2021 
Target
Name:
Mitogen-activated protein kinase kinase kinase kinase 1
Synonyms:
HPK1 MAP4K1
Type:
PROTEIN
Mol. Mass.:
91316.07
Organism:
Homo sapiens (Human)
Description:
ChEMBL_586597
Residue:
833
  
Inhibitor
Name:
BDBM501096
Synonyms:
7-((6- ((dimethylamino)- methyl)-5- morpholinopy- ridin-2- yl)amino)-4- (1-methyl-1H- pyrrolo[2,3- b]pyridin-4- yl)-2,3- dihydro-1H- pyrrolo[3,4- c]pyridin-1- one US11078201, Compound I-768 | US11548890, Compound I-768
Type:
Small organic molecule
Emp. Form.:
C27H30N8O2
Mol. Mass.:
498.5795
SMILES:
CN(C)Cc1nc(Nc2cnc(c3CNC(=O)c23)-c2ccnc3n(C)ccc23)ccc1N1CCOCC1
: