Target
Mitogen-activated protein kinase kinase kinase kinase 1
Ligand
BDBM501139
Substrate
Meas. Tech.
Biochemical Enzyme Assay
IC50
<100±n/a nM
Citation
 Kaila, NLinney, IWard, SWishart, GWhittaker, BCote, AGreenwood, JRLeffler, AAlbanese, SKSeverance, DL Substituted isoindolin-1-ones and 2,3-dihydro-1H-pyrrolo[3,4-c]pyridin-1-ones as HPK1 antagonists US Patent  US11034694 Publication Date 6/15/2021 
Target
Name:
Mitogen-activated protein kinase kinase kinase kinase 1
Synonyms:
HPK1 MAP4K1
Type:
PROTEIN
Mol. Mass.:
91316.07
Organism:
Homo sapiens (Human)
Description:
ChEMBL_586597
Residue:
833
  
Inhibitor
Name:
BDBM501139
Synonyms:
7-((6-(((S)-3- hydroxypyrroli- din-1- yl)methyl)-5- ((S)-THF-3- yl)pyridin-2- yl)amino)-4- (1-methyl-1H- pyrrolo[2,3- b]pyridin-4- yl)-2,3- dihydro-1H- pyrrolo[3,4- c]pyridin-1- one US11078201, Compound I-811 | US11548890, Compound I-811
Type:
Small organic molecule
Emp. Form.:
C29H31N7O3
Mol. Mass.:
525.6015
SMILES:
Cn1ccc2c(ccnc12)-c1ncc(Nc2ccc([C@@H]3CCOC3)c(CN3CC[C@H](O)C3)n2)c2C(=O)NCc12
: