Target
Cytochrome P450 11B2, mitochondrial
Ligand
BDBM287693
Substrate
Meas. Tech.
Enzyme Assay
IC50
50±n/a nM
Citation
 Sparks, SYates, CMShaver, SRHoekstra, WJ Metalloenzyme inhibitor compounds US Patent  US11040034 Publication Date 6/22/2021 
Target
Name:
Cytochrome P450 11B2, mitochondrial
Synonyms:
Aldosterone Synthase (CYP11B2) Aldosterone-synthesizing enzyme CYP11B2 Cytochrome P450 11B2 Cytochrome P450 11B2, mitochondrial P-450C18 | Steroid 18-hydroxylase
Type:
Protein
Mol. Mass.:
57582.15
Organism:
Homo sapiens (Human)
Description:
P19099
Residue:
503
  
Inhibitor
Name:
BDBM287693
Synonyms:
US10085984, Example 71 | US11040034, Ex. No. 71
Type:
Small organic molecule
Emp. Form.:
C16H11F5N4
Mol. Mass.:
354.2774
SMILES:
Fc1cc2nc(-c3cnnc(CC(F)(F)F)c3)n(C3CC3)c2cc1F
: