Target
Cytochrome P450 11B2, mitochondrial
Ligand
BDBM287714
Substrate
Meas. Tech.
Enzyme Assay
IC50
50±n/a nM
Citation
 Sparks, SYates, CMShaver, SRHoekstra, WJ Metalloenzyme inhibitor compounds US Patent  US11040034 Publication Date 6/22/2021 
Target
Name:
Cytochrome P450 11B2, mitochondrial
Synonyms:
Aldosterone Synthase (CYP11B2) Aldosterone-synthesizing enzyme CYP11B2 Cytochrome P450 11B2 Cytochrome P450 11B2, mitochondrial P-450C18 | Steroid 18-hydroxylase
Type:
Protein
Mol. Mass.:
57582.15
Organism:
Homo sapiens (Human)
Description:
P19099
Residue:
503
  
Inhibitor
Name:
BDBM287714
Synonyms:
US10085984, Example 92 | US11040034, Ex. No. 92
Type:
Small organic molecule
Emp. Form.:
C15H11F3N4
Mol. Mass.:
304.2698
SMILES:
FCc1cc(cnn1)-c1nc2cc(F)c(F)cc2n1C1CC1
: