Target
Cytochrome P450 11B2, mitochondrial
Ligand
BDBM287758
Substrate
Meas. Tech.
Enzyme Assay
IC50
50±n/a nM
Citation
 Sparks, SYates, CMShaver, SRHoekstra, WJ Metalloenzyme inhibitor compounds US Patent  US11040034 Publication Date 6/22/2021 
Target
Name:
Cytochrome P450 11B2, mitochondrial
Synonyms:
Aldosterone Synthase (CYP11B2) Aldosterone-synthesizing enzyme CYP11B2 Cytochrome P450 11B2 Cytochrome P450 11B2, mitochondrial P-450C18 | Steroid 18-hydroxylase
Type:
Protein
Mol. Mass.:
57582.15
Organism:
Homo sapiens (Human)
Description:
P19099
Residue:
503
  
Inhibitor
Name:
BDBM287758
Synonyms:
US10085984, Example 136 | US11040034, Ex. No. 136
Type:
Small organic molecule
Emp. Form.:
C17H14FN5
Mol. Mass.:
307.325
SMILES:
CC(F)c1cc(cnn1)-c1nc2ccc(cc2n1C1CC1)C#N
: