Target
Sentrin-specific protease 2
Ligand
BDBM103829
Substrate
Meas. Tech.
Enzyme Kinetic Assay
IC50
2300±1800 nM
Citation
 Chen, YChen, CNamanja, A Methods of identifying SENP1 inhibitors US Patent  US11041859 Publication Date 6/22/2021 
Target
Name:
Sentrin-specific protease 2
Synonyms:
KIAA1331 SENP2_HUMAN | Sentrin-specific protease 2 (SENP2)
Type:
Protein
Mol. Mass.:
67890.62
Organism:
Homo sapiens (Human)
Description:
Q9HC62
Residue:
589
  
Inhibitor
Name:
BDBM103829
Synonyms:
SPI-04 US9791447, Compound SPI-04
Type:
Small organic molecule
Emp. Form.:
C34H25N6O12S4
Mol. Mass.:
837.856
SMILES:
Nc1ccc(\N=N\c2ccc(\C=C\c3ccc(cc3S(O)(=O)=O)\N=N\c3ccc(N)c4ccc(cc34)S([O-])(=O)=O)c(c2)S(O)(=O)=O)c2cc(ccc12)S(O)(=O)=O
: