Target
Sentrin-specific protease 7
Ligand
BDBM103829
Substrate
Meas. Tech.
Enzyme Kinetic Assay
IC50
3400±1500 nM
Citation
 Chen, YChen, CNamanja, A Methods of identifying SENP1 inhibitors US Patent  US11041859 Publication Date 6/22/2021 
Target
Name:
Sentrin-specific protease 7
Synonyms:
KIAA1707 SENP7_HUMAN SUSP2 | Sentrin-specific protease 7 (SENP7)
Type:
Protein
Mol. Mass.:
119657.39
Organism:
Homo sapiens (Human)
Description:
Q9BQF6
Residue:
1050
  
Inhibitor
Name:
BDBM103829
Synonyms:
SPI-04 US9791447, Compound SPI-04
Type:
Small organic molecule
Emp. Form.:
C34H25N6O12S4
Mol. Mass.:
837.856
SMILES:
Nc1ccc(\N=N\c2ccc(\C=C\c3ccc(cc3S(O)(=O)=O)\N=N\c3ccc(N)c4ccc(cc34)S([O-])(=O)=O)c(c2)S(O)(=O)=O)c2cc(ccc12)S(O)(=O)=O
: