Target
Plasma kallikrein
Ligand
BDBM433371
Substrate
Meas. Tech.
Activity Assay
Ki
75.0±n/a nM
Citation
 Kotian, PLBabu, YSKumar, VSZhang, WVogeti, L Human plasma kallikrein inhibitors US Patent  US11066360 Publication Date 7/20/2021 
Target
Name:
Plasma kallikrein
Synonyms:
Fletcher factor KLKB1 Kallikrein Plasma kallikrein heavy chain Plasma prekallikrein
Type:
Protein
Mol. Mass.:
71391.16
Organism:
Homo sapiens (Human)
Description:
P03952
Residue:
638
  
Inhibitor
Name:
BDBM433371
Synonyms:
US10562850, Compound 30b | US11066360, Compound 30b
Type:
Small organic molecule
Emp. Form.:
C44H39Cl2FN6O4
Mol. Mass.:
805.723
SMILES:
O[C@@]1(C[C@@H](N(C1)C(=O)Nc1ccc(Cl)cc1)C(=O)Nc1cc(ccc1F)C(CCC1CC1)(NC(=O)Nc1ccc(Cl)cc1)c1cccc(c1)C#N)c1ccccc1
: