Target
Plasma kallikrein
Ligand
BDBM433415
Substrate
Meas. Tech.
Activity Assay
Ki
<50.0±n/a nM
Citation
 Kotian, PLBabu, YSKumar, VSZhang, WVogeti, L Human plasma kallikrein inhibitors US Patent  US11066360 Publication Date 7/20/2021 
Target
Name:
Plasma kallikrein
Synonyms:
Fletcher factor KLKB1 Kallikrein Plasma kallikrein heavy chain Plasma prekallikrein
Type:
Protein
Mol. Mass.:
71391.16
Organism:
Homo sapiens (Human)
Description:
P03952
Residue:
638
  
Inhibitor
Name:
BDBM433415
Synonyms:
US10562850, Compound 30a | US11066360, Compound 30a
Type:
Small organic molecule
Emp. Form.:
C37H35ClFN5O3
Mol. Mass.:
652.157
SMILES:
NC(CCC1CC1)(c1cccc(c1)C#N)c1ccc(F)c(NC(=O)[C@H]2C[C@@](O)(CN2C(=O)Nc2ccc(Cl)cc2)c2ccccc2)c1
: