Target
Plasma kallikrein
Ligand
BDBM433445
Substrate
Meas. Tech.
Activity Assay
Ki
75.0±n/a nM
Citation
 Kotian, PLBabu, YSKumar, VSZhang, WVogeti, L Human plasma kallikrein inhibitors US Patent  US11066360 Publication Date 7/20/2021 
Target
Name:
Plasma kallikrein
Synonyms:
Fletcher factor KLKB1 Kallikrein Plasma kallikrein heavy chain Plasma prekallikrein
Type:
Protein
Mol. Mass.:
71391.16
Organism:
Homo sapiens (Human)
Description:
P03952
Residue:
638
  
Inhibitor
Name:
BDBM433445
Synonyms:
US10562850, Compound 49d | US11066360, Compound 49d
Type:
Small organic molecule
Emp. Form.:
C29H32ClFN6O2
Mol. Mass.:
551.055
SMILES:
C[C@@H]1C[C@@H](N(C1)C(=O)Nc1ccc(Cl)cn1)C(=O)Nc1cc(ccc1F)C(N)(CCC1CC1)c1ccncc1
: