Target
Plasma kallikrein
Ligand
BDBM433472
Substrate
Meas. Tech.
Activity Assay
Ki
>100.0±n/a nM
Citation
 Kotian, PLBabu, YSKumar, VSZhang, WVogeti, L Human plasma kallikrein inhibitors US Patent  US11066360 Publication Date 7/20/2021 
Target
Name:
Plasma kallikrein
Synonyms:
Fletcher factor KLKB1 Kallikrein Plasma kallikrein heavy chain Plasma prekallikrein
Type:
Protein
Mol. Mass.:
71391.16
Organism:
Homo sapiens (Human)
Description:
P03952
Residue:
638
  
Inhibitor
Name:
BDBM433472
Synonyms:
US10562850, Compound 86a | US11066360, Compound 86a
Type:
Small organic molecule
Emp. Form.:
C31H32FN5O3
Mol. Mass.:
541.6159
SMILES:
CO[C@@H]1C[C@@H](N(C1)C(=O)c1cccc(c1)C#N)C(=O)Nc1cc(ccc1F)C(N)(CCC1CC1)c1ccncc1
: