Target
Tyrosine-protein kinase JAK1 [574-1154]
Ligand
BDBM505108
Substrate
Meas. Tech.
Enzymatic Inhibition Assay
IC50
0.200±n/a nM
Citation
 Fernandes, PKrawczuk, PJTichenor, MS Small molecule inhibitors of the JAK family of kinases US Patent  US11066406 Publication Date 7/20/2021 
Target
Name:
Tyrosine-protein kinase JAK1 [574-1154]
Synonyms:
JAK1 JAK1A JAK1_HUMAN
Type:
Protein
Mol. Mass.:
66641.39
Organism:
Homo sapiens (Human)
Description:
P23458[574-1154]
Residue:
581
  
Inhibitor
Name:
BDBM505108
Synonyms:
US11066406, Ex. 2
Type:
Small organic molecule
Emp. Form.:
C19H19N7
Mol. Mass.:
345.4011
SMILES:
N#CCC1CCC(CC1)n1c(nc2cnc3[nH]ccc3c12)-c1c[nH]cn1
: