Target
Plasmepsin I
Ligand
BDBM7990
Substrate
Peptide Substrate
Meas. Tech.
Enzyme Inhibition Measurements
Ki
40±n/a nM
Citation
 Johansson, POChen, YBelfrage, AKBlackman, MJKvarnstrom, IJansson, KVrang, LHamelink, EHallberg, ARosenquist, ASamuelsson, B Design and synthesis of potent inhibitors of the malaria aspartyl proteases plasmepsin I and II. Use of solid-phase synthesis to explore novel statine motifs. J Med Chem 47:3353-66 (2004)  
Target
Name:
Plasmepsin I
Synonyms:
PFAPG PMI Plasmepsin-1 precursor
Type:
Enzyme
Mol. Mass.:
51463.30
Organism:
Plasmodium falciparum
Description:
Residue:
452
  
Inhibitor
Name:
BDBM7990
Synonyms:
(3S,4S)-5-(4-Bromobenzyloxy)-4-(3,3-diphenylpropionylamino)-3-hydroxypentanoic Acid [(S)-1-((S)-1-Carbamoyl-3-methylbutylcarbamoyl)ethyl]amide Statine-like inhibitor 29
Type:
Small organic molecule
Emp. Form.:
C36H45BrN4O6
Mol. Mass.:
709.67
SMILES:
CC(C)C[C@H](NC(=O)[C@H](C)NC(=O)C[C@H](O)[C@H](COCc1ccc(Br)cc1)NC(=O)CC(c1ccccc1)c1ccccc1)C(N)=O
:
Substrate
Name:
Peptide Substrate
Synonyms:
Type:
Peptide
Mol. Mass.:
3501.67
Organism:
Description:
Residue:
31