Target
P2X purinoceptor 7
Ligand
BDBM505124
Substrate
Meas. Tech.
Inhibition Assay
IC50
11.0±n/a nM
Citation
 Masuda, KSugiyama, SYamada, TKojima, EOgawa, TKobayashi, NKai, H Bicyclic nitrogen-containing heterocyclic derivatives and pharmaceutical composition comprising the same US Patent  US11066409 Publication Date 7/20/2021 
Target
Name:
P2X purinoceptor 7
Synonyms:
ATP receptor P2RX7_HUMAN P2X purinoceptor 7 (P2X7) P2Z receptor | Purinergic receptor
Type:
Protein
Mol. Mass.:
68602.85
Organism:
Homo sapiens (Human)
Description:
Q99572
Residue:
595
  
Inhibitor
Name:
BDBM505124
Synonyms:
US11066409, Compound I-0059
Type:
Small organic molecule
Emp. Form.:
C21H20F2N4O2
Mol. Mass.:
398.4059
SMILES:
CCc1nc(OC)ccc1Nc1nc(=O)cc2CCC(c3cc(F)cc(F)c3)n12
: