Target
P2X purinoceptor 7
Ligand
BDBM505150
Substrate
Meas. Tech.
Inhibition Assay
IC50
<10±n/a nM
Citation
 Masuda, KSugiyama, SYamada, TKojima, EOgawa, TKobayashi, NKai, H Bicyclic nitrogen-containing heterocyclic derivatives and pharmaceutical composition comprising the same US Patent  US11066409 Publication Date 7/20/2021 
Target
Name:
P2X purinoceptor 7
Synonyms:
ATP receptor P2RX7_HUMAN P2X purinoceptor 7 (P2X7) P2Z receptor | Purinergic receptor
Type:
Protein
Mol. Mass.:
68602.85
Organism:
Homo sapiens (Human)
Description:
Q99572
Residue:
595
  
Inhibitor
Name:
BDBM505150
Synonyms:
US11066409, Compound I-0007
Type:
Small organic molecule
Emp. Form.:
C20H18ClN3O
Mol. Mass.:
351.829
SMILES:
Cc1c(Cl)cccc1Nc1nc(=O)cc2CCC(c3ccccc3)n12
: