Target
Indoleamine 2,3-dioxygenase 1
Ligand
BDBM506695
Substrate
Meas. Tech.
IDO1 Cell-Based Assay
IC50
4.70±n/a nM
Citation
 Lewis, RTHamilton, MJones, PPetrocchi, AReyna, NMcAfoos, TCross, JBSoth, MJ Compounds useful as inhibitors of indoleamine 2,3-dioxygenase and/or tryptophan dioxygenase US Patent  US11046649 Publication Date 6/29/2021 
Target
Name:
Indoleamine 2,3-dioxygenase 1
Synonyms:
I23O1_HUMAN IDO-1 INDO Indoleamine 2,3-dioxygenase | Indoleamine-pyrrole 2,3-dioxygenase
Type:
Enzyme
Mol. Mass.:
45330.80
Organism:
Homo sapiens (Human)
Description:
P14902
Residue:
403
  
Inhibitor
Name:
BDBM506695
Synonyms:
2-((1R,3s,5S,6r)-3-((6- fluoroquinolin-4-yl)oxy)- bicyclo[3.1.0]hexan-6-yl)- N-(2-methyl-1H-indol-6- yl)propanamide | US11046649, Ex. 73
Type:
Small organic molecule
Emp. Form.:
C27H26FN3O2
Mol. Mass.:
443.5126
SMILES:
CC([C@@H]1[C@H]2C[C@@H](C[C@@H]12)Oc1ccnc2ccc(F)cc12)C(=O)Nc1ccc2cc(C)[nH]c2c1
: