Target
Indoleamine 2,3-dioxygenase 1
Ligand
BDBM506734
Substrate
Meas. Tech.
IDO1 Cell-Based Assay
IC50
4.20±n/a nM
Citation
 Lewis, RTHamilton, MJones, PPetrocchi, AReyna, NMcAfoos, TCross, JBSoth, MJ Compounds useful as inhibitors of indoleamine 2,3-dioxygenase and/or tryptophan dioxygenase US Patent  US11046649 Publication Date 6/29/2021 
Target
Name:
Indoleamine 2,3-dioxygenase 1
Synonyms:
I23O1_HUMAN IDO-1 INDO Indoleamine 2,3-dioxygenase | Indoleamine-pyrrole 2,3-dioxygenase
Type:
Enzyme
Mol. Mass.:
45330.80
Organism:
Homo sapiens (Human)
Description:
P14902
Residue:
403
  
Inhibitor
Name:
BDBM506734
Synonyms:
N-(5-(1H-1,2,4-triazol-1- yl)pyridin-2-yl)-2- cyclopropyl-2- ((1R,3s,5S,6r)-3-((6- fluoroquinolin-4-yl)oxy)- bicyclo[3.1.0]hexan-6- yl)acetamide | US11046649, Ex. 112
Type:
Small organic molecule
Emp. Form.:
C27H25FN6O2
Mol. Mass.:
484.5248
SMILES:
Fc1ccc2nccc(O[C@H]3C[C@H]4[C@@H](C3)[C@@H]4C(C3CC3)C(=O)Nc3ccc(cn3)-n3cncn3)c2c1
: