Target
Indoleamine 2,3-dioxygenase 1
Ligand
BDBM506745
Substrate
Meas. Tech.
IDO1 Cell-Based Assay
IC50
1.54±n/a nM
Citation
 Lewis, RTHamilton, MJones, PPetrocchi, AReyna, NMcAfoos, TCross, JBSoth, MJ Compounds useful as inhibitors of indoleamine 2,3-dioxygenase and/or tryptophan dioxygenase US Patent  US11046649 Publication Date 6/29/2021 
Target
Name:
Indoleamine 2,3-dioxygenase 1
Synonyms:
I23O1_HUMAN IDO-1 INDO Indoleamine 2,3-dioxygenase | Indoleamine-pyrrole 2,3-dioxygenase
Type:
Enzyme
Mol. Mass.:
45330.80
Organism:
Homo sapiens (Human)
Description:
P14902
Residue:
403
  
Inhibitor
Name:
BDBM506745
Synonyms:
2-cyclopropyl-2- ((1R,3s,5S,6r)-3-((6- fluoroquinolin-4-yl)oxy)- bicyclo[3.1.0]hexan-6-yl)- N-(5-methylpyrazin-2-yl)- acetamide | US11046649, Ex. 123
Type:
Small organic molecule
Emp. Form.:
C25H25FN4O2
Mol. Mass.:
432.49
SMILES:
Cc1cnc(NC(=O)C(C2CC2)[C@@H]2[C@H]3C[C@@H](C[C@@H]23)Oc2ccnc3ccc(F)cc23)cn1
: