Target
Indoleamine 2,3-dioxygenase 1
Ligand
BDBM506757
Substrate
Meas. Tech.
IDO1 Cell-Based Assay
IC50
8.19±n/a nM
Citation
 Lewis, RTHamilton, MJones, PPetrocchi, AReyna, NMcAfoos, TCross, JBSoth, MJ Compounds useful as inhibitors of indoleamine 2,3-dioxygenase and/or tryptophan dioxygenase US Patent  US11046649 Publication Date 6/29/2021 
Target
Name:
Indoleamine 2,3-dioxygenase 1
Synonyms:
I23O1_HUMAN IDO-1 INDO Indoleamine 2,3-dioxygenase | Indoleamine-pyrrole 2,3-dioxygenase
Type:
Enzyme
Mol. Mass.:
45330.80
Organism:
Homo sapiens (Human)
Description:
P14902
Residue:
403
  
Inhibitor
Name:
BDBM506757
Synonyms:
1-((1R,3s,5S,6r)-6-(1-(5- chloro-1H-benzo[d]- imidazol-2-yl)ethyl)- bicyclo[3.1.0]hexan-3-yl)- 5,6-difluoro-1H- benzo[d]imidazole | US11046649, Ex. 135
Type:
Small organic molecule
Emp. Form.:
C22H19ClF2N4
Mol. Mass.:
412.863
SMILES:
CC([C@@H]1[C@H]2C[C@@H](C[C@@H]12)n1cnc2cc(F)c(F)cc12)c1nc2cc(Cl)ccc2[nH]1
: