BDBM101476 US8524710, 53::US8530652, 3::US8530652, 47
SMILES CN1CCN([C@@H](Cc2ccccc2)C1)C(=O)N1Cc2c(Nc3nc(Cl)nc4ccsc34)[nH]nc2C1(C)C
InChI Key InChIKey=ZBEYISOSYNXIMK-KRWDZBQOSA-N
Data  1 KI  1 EC50
  Tab Delimited (TSV)   2D SDfile   Computed 3D by Vconf -m prep SDfile
Find this compound or compounds like it in BindingDB:
Activity Spreadsheet -- Enzyme Inhibition Constant Data from BindingDB
Found 1 hit for monomerid = 101476
TargetSerine/threonine-protein kinase PAK 4(Homo sapiens (Human))
Agouron Pharmaceuticals
US Patent
LigandPNGBDBM101476(US8524710, 53 | US8530652, 3 | US8530652, 47)
Affinity DataKi:  11nM EC50:  16nM. Assay description: The enzymatic activity of PAK4 KD was measured by its ability to catalyzed the transfer of a phosphate residue from a nucleoside triphosphate to an a...
In DepthDetails US Patent