BDBM101674 US9695160, 19::US9796707, Compound 19
SMILES FC(F)(F)c1ccc(N2CCN(Cc3ccccc3)CC2)c(NC(=O)c2ccco2)c1
InChI Key InChIKey=WJSTURLRVIKCBZ-UHFFFAOYSA-N
Data  2 IC50
  Tab Delimited (TSV)   2D SDfile   Computed 3D by Vconf -m prep SDfile
Find this compound or compounds like it in BindingDB:
Activity Spreadsheet -- Enzyme Inhibition Constant Data from BindingDB
Found 2 hits for monomerid = 101674
TargetSRSF protein kinase 1(Homo sapiens (Human))
The University of Nottingham
US Patent
LigandPNGBDBM101674(US9695160, 19 | US9796707, Compound 19)
Affinity DataIC50:  14.1nM. Assay description: Candidate compounds were screened by the Kinase-Glo assay (Promega; Koresawa and Okabe, 2004), the results of which are shown in Table 1 and Table 2....
In DepthDetails US Patent
TargetSRSF protein kinase 1(Homo sapiens (Human))
The University of Nottingham
US Patent
LigandPNGBDBM101674(US9695160, 19 | US9796707, Compound 19)
Affinity DataIC50:  14nMT: 2°C. Assay description: Candidate compounds were screened by the Kinase-Glo assay (Promega; Koresawa and Okabe, 2004), the results of which are shown in Table 1 and Table 2....
In DepthDetails US Patent