BDBM101737 US9695160, 32::US9796707, Compound 32
SMILES COc1cccc(CN2CCN(CC2)c2ccc(cc2NC(=O)c2ccc(o2)-c2ccncc2)C(F)(F)F)c1
InChI Key InChIKey=LETPCCBWSPAYDT-UHFFFAOYSA-N
Data  2 IC50
  Tab Delimited (TSV)   2D SDfile   Computed 3D by Vconf -m prep SDfile
Find this compound or compounds like it in BindingDB:
Activity Spreadsheet -- Enzyme Inhibition Constant Data from BindingDB
Found 2 hits for monomerid = 101737
TargetSRSF protein kinase 1(Homo sapiens (Human))
The University of Nottingham
US Patent
LigandPNGBDBM101737(US9695160, 32 | US9796707, Compound 32)
Affinity DataIC50:  1.55E+3nM. Assay description: Candidate compounds were screened by the Kinase-Glo assay (Promega; Koresawa and Okabe, 2004), the results of which are shown in Table 1 and Table 2....
In DepthDetails US Patent
TargetSRSF protein kinase 1(Homo sapiens (Human))
The University of Nottingham
US Patent
LigandPNGBDBM101737(US9695160, 32 | US9796707, Compound 32)
Affinity DataIC50:  1.55E+3nMT: 2°C. Assay description: Candidate compounds were screened by the Kinase-Glo assay (Promega; Koresawa and Okabe, 2004), the results of which are shown in Table 1 and Table 2....
In DepthDetails US Patent