BDBM101764 US8530490, 24
SMILES C[C@@H](NS(=O)(=O)CCCOCn1ccc(=O)[nH]c1=O)c1ccc(F)c(OC2CCCC2)c1
InChI Key InChIKey=PFINEOYKWGERPC-OAHLLOKOSA-N
Data  2 IC50
  Tab Delimited (TSV)   2D SDfile   Computed 3D by Vconf -m prep SDfile
Find this compound or compounds like it in BindingDB:
Activity Spreadsheet -- Enzyme Inhibition Constant Data from BindingDB
Found 2 hits for monomerid = 101764
TargetDeoxyuridine 5'-triphosphate nucleotidohydrolase, mitochondrial(Homo sapiens (Human))
Taiho Pharmaceutical
US Patent
LigandPNGBDBM101764(US8530490, 24)
Affinity DataIC50:  40nMpH: 7.4 T: 2°C. Assay description: The inhibitory activity of these compounds of the present invention against human dUTPase was determined by measuring the production of [5-3H]deoxyur...
In DepthDetails US Patent
TargetDeoxyuridine 5'-triphosphate nucleotidohydrolase, mitochondrial(Homo sapiens (Human))
Taiho Pharmaceutical
US Patent
LigandPNGBDBM101764(US8530490, 24)
Affinity DataIC50:  40nM. Assay description: The inhibitory activity of the compound against human dUTPase was determined by measuring the production of [5-3H]deoxyuridine monophosphate from [5-...
In DepthDetails US Patent