BDBM101832 US9695160, 45::US9796707, Compound 45
SMILES OCc1ccc(o1)C(=O)Nc1cc(ccc1N1CCN(Cc2ccccn2)CC1)C(F)(F)F
InChI Key InChIKey=MZHLLWJIEZYOSL-UHFFFAOYSA-N
Data  2 IC50
  Tab Delimited (TSV)   2D SDfile   Computed 3D by Vconf -m prep SDfile
Find this compound or compounds like it in BindingDB:
Activity Spreadsheet -- Enzyme Inhibition Constant Data from BindingDB
Found 2 hits for monomerid = 101832
TargetSRSF protein kinase 1(Homo sapiens (Human))
The University of Nottingham
US Patent
LigandPNGBDBM101832(US9695160, 45 | US9796707, Compound 45)
Affinity DataIC50:  119nM. Assay description: Candidate compounds were screened by the Kinase-Glo assay (Promega; Koresawa and Okabe, 2004), the results of which are shown in Table 1 and Table 2....
Ligand InfoPC cidPC sid
In DepthDetails US Patent
TargetSRSF protein kinase 1(Homo sapiens (Human))
The University of Nottingham
US Patent
LigandPNGBDBM101832(US9695160, 45 | US9796707, Compound 45)
Affinity DataIC50:  119nMT: 2°C. Assay description: Candidate compounds were screened by the Kinase-Glo assay (Promega; Koresawa and Okabe, 2004), the results of which are shown in Table 1 and Table 2....
Ligand InfoPC cidPC sid
In DepthDetails US Patent