BDBM101890 US8530490, 160
SMILES CC(C)(CCCOCn1ccc(=O)[nH]c1=O)NS(=O)(=O)c1cccc(OCC(F)F)c1
InChI Key InChIKey=YEXKMPZVKFRICD-UHFFFAOYSA-N
Data  1 IC50
  Tab Delimited (TSV)   2D SDfile   Computed 3D by Vconf -m prep SDfile
Find this compound or compounds like it in BindingDB:
Activity Spreadsheet -- Enzyme Inhibition Constant Data from BindingDB
Found 1 hit for monomerid = 101890
TargetDeoxyuridine 5'-triphosphate nucleotidohydrolase, mitochondrial(Homo sapiens (Human))
Taiho Pharmaceutical
US Patent
LigandPNGBDBM101890(US8530490, 160)
Affinity DataIC50:  140nM. Assay description: The inhibitory activity of the compound against human dUTPase was determined by measuring the production of [5-3H]deoxyuridine monophosphate from [5-...
In DepthDetails US Patent