BDBM103073 US8541407, 50
SMILES O=C(Nc1ccc(cc1)-c1nnc2-c3ccccc3Nc3ncccc3-n12)c1ccco1
InChI Key InChIKey=NGWZGQJUTNDVDF-UHFFFAOYSA-N
Data  1 IC50
  Tab Delimited (TSV)   2D SDfile   Computed 3D by Vconf -m prep SDfile
Find this compound or compounds like it in BindingDB:
Activity Spreadsheet -- Enzyme Inhibition Constant Data from BindingDB
Found 1 hit for monomerid = 103073
TargetRAC-alpha serine/threonine-protein kinase(Homo sapiens (Human))
Arqule
US Patent
LigandPNGBDBM103073(US8541407, 50)
Affinity DataIC50:  130nM. Assay description: Biochemical assay using Akt AlphaScreen (Amplified Luminescent Proximity Homogeneous Assay) technology.
In DepthDetails US Patent