BDBM103144 US8541407, 121
SMILES Fc1ccccc1NC(=O)NCc1ccc(cc1)-c1nnc2-c3ccccc3Nc3ncccc3-n12
InChI Key InChIKey=AKNGNVBZNUSGHJ-UHFFFAOYSA-N
Data  1 IC50
  Tab Delimited (TSV)   2D SDfile   Computed 3D by Vconf -m prep SDfile
Find this compound or compounds like it in BindingDB:
Activity Spreadsheet -- Enzyme Inhibition Constant Data from BindingDB
Found 1 hit for monomerid = 103144
TargetRAC-alpha serine/threonine-protein kinase(Homo sapiens (Human))
Arqule
US Patent
LigandPNGBDBM103144(US8541407, 121)
Affinity DataIC50:  310nM. Assay description: Biochemical assay using Akt AlphaScreen (Amplified Luminescent Proximity Homogeneous Assay) technology.
In DepthDetails US Patent