BDBM105225 US8580800, 1
SMILES CN1CC2=C([C@H](NC(=O)N2c2cccc(c2)C(F)(F)F)c2ccc(cc2)C#N)C(=O)N1
InChI Key InChIKey=UPNMBPLODWPJQQ-GOSISDBHSA-N
Data  1 IC50
PDB links: 1 PDB ID matches this monomer.
  Tab Delimited (TSV)   2D SDfile   Computed 3D by Vconf -m prep SDfile
Find this compound or compounds like it in BindingDB:
Activity Spreadsheet -- Enzyme Inhibition Constant Data from BindingDB
Found 1 hit for monomerid = 105225
TargetNeutrophil elastase(Homo sapiens (Human))
Bayer Intellectual Property
US Patent
LigandPNGBDBM105225(US8580800, 1)
Affinity DataIC50:  28nMpH: 7.4 T: 2°C. Assay description: The potency of the compounds of the invention is ascertained in an in vitro inhibition assay. The HNE-mediated amidolytic cleavage of a suitable pept...