BDBM10588 3-Chloro-6,7,10,11-tetrahydro-9-methyl-12-{{7-[(6-chloro-1,2,3,4-tetrahydroacridin-9-yl)amino]heptyl}amino}-7,11-methanocycloocta[b]quinoline dihydrochloride::7-chloro-N-{7-[(6-chloro-1,2,3,4-tetrahydroacridin-9-yl)amino]heptyl}-15-methyl-10-azatetracyclo[11.3.1.0^{2,11}.0^{4,9}]heptadeca-2(11),3,5,7,9,14-hexaen-3-amine dihydrochloride::CHEMBL2011492::Huprine-Tacrine Heterodimer 18b
SMILES CC1=CC2CC(C1)c1c(C2)nc2cc(Cl)ccc2c1NCCCCCCCNc1c2CCCCc2nc2cc(Cl)ccc12
InChI Key InChIKey=GCPORJYZTJZXFH-UHFFFAOYSA-N
Data  4 IC50
  Tab Delimited (TSV)   2D SDfile   Computed 3D by Vconf -m prep SDfile
Find this compound or compounds like it in BindingDB:
Activity Spreadsheet -- Enzyme Inhibition Constant Data from BindingDB
Found 4 hits for monomerid = 10588
TargetAcetylcholinesterase(Homo sapiens (Human))
Universitat De Barcelona
LigandPNGBDBM10588(3-Chloro-6,7,10,11-tetrahydro-9-methyl-12-{{7-[(6-...)
Affinity DataIC50:  0.330nMpH: 8.0 T: 2°C. Assay description: The cholinesterase assays were performed using colorimetric method reported by Ellman. Enzyme activity was determined by measuring the absorbance at...
In DepthDetails ArticlePubMed
TargetCholinesterase(Homo sapiens (Human))
Universitat De Barcelona
Curated by ChEMBL
LigandPNGBDBM10588(3-Chloro-6,7,10,11-tetrahydro-9-methyl-12-{{7-[(6-...)
Affinity DataIC50:  73nM. Assay description: Inhibition of human serum BChE using butyrylthiocholine iodide as substrate preincubated for 20 mins prior substrate addition measured after 5 mins b...
In DepthDetails ArticlePubMed
TargetAcetylcholinesterase(Homo sapiens (Human))
Universitat De Barcelona
LigandPNGBDBM10588(3-Chloro-6,7,10,11-tetrahydro-9-methyl-12-{{7-[(6-...)
Affinity DataIC50:  4nM. Assay description: Inhibition of human recombinant AChE using acetylthiocholine iodide as substrate preincubated for 20 mins prior substrate addition measured after 5 m...
In DepthDetails ArticlePubMed
TargetCholinesterase(Homo sapiens (Human))
Universitat De Barcelona
Curated by ChEMBL
LigandPNGBDBM10588(3-Chloro-6,7,10,11-tetrahydro-9-methyl-12-{{7-[(6-...)
Affinity DataIC50:  7.38nM. Assay description: The cholinesterase assays were performed using colorimetric method reported by Ellman. Enzyme activity was determined by measuring the absorbance at...
In DepthDetails ArticlePubMed