BDBM106751 2‐[2‐(3‐fluoropyrrolidine‐1‐carbonyl)pyrrolidin‐1‐ yl]‐1‐[4‐(pyridin‐2‐yl)piperazin‐1‐yl]ethan‐1‐one::2-[2-(3-Fluoro-pyrrolidine-1-carbonyl)-pyrrolidin-1- yl]-1-(4-pyridin-2-yl-piperazin-1-yl)-ethanone (Compound 9)
SMILES FC1CCN(C1)C(=O)C1CCCN1CC(=O)N1CCN(CC1)c1ccccn1
InChI Key InChIKey=IKKNHQBNFIHGCU-UHFFFAOYSA-N
Data  1 IC50
  Tab Delimited (TSV)   2D SDfile   Computed 3D by Vconf -m prep SDfile
Find this compound or compounds like it in BindingDB:
Activity Spreadsheet -- Enzyme Inhibition Constant Data from BindingDB
Found 1 hit for monomerid = 106751
TargetDipeptidyl peptidase 4(Homo sapiens (Human))
Delhi Institute of Pharmaceutical Sciences and Research
LigandPNGBDBM106751(2‐[2‐(3‐fluoropyrrolidine‐...)
Affinity DataIC50:  830nMT: 2°C. Assay description: The enzyme assay was performed using DPP IV drug discovery kit (BML-AK 499; Enzo Life Sciences, Plymouth Meeting, PA, USA). The activity of test com...
Ligand InfoPC cidPC sid
In DepthDetails ArticlePubMed