BDBM10684 (-)-(3aS)-1,8-Dibenzyl-3a-methyl-1,2,3,3a,8,8a-hexahydropyrrol[2,3-b]indol-5-yl N-Methylcarbamate::(-)-N1,N8-bisbenzylnorphysostigmine::(-)19::(3aS)-1,8-dibenzyl-3a-methyl-1H,2H,3H,3aH,8H,8aH-pyrrolo[2,3-b]indol-5-yl N-methylcarbamate
SMILES CNC(=O)Oc1ccc2N(Cc3ccccc3)C3N(Cc4ccccc4)CC[C@@]3(C)c2c1
InChI Key InChIKey=YSZQKPILONCHJM-GPNIZQGCSA-N
Data  2 IC50
  Tab Delimited (TSV)   2D SDfile   Computed 3D by Vconf -m prep SDfile
Find this compound or compounds like it in BindingDB:
Activity Spreadsheet -- Enzyme Inhibition Constant Data from BindingDB
Found 2 hits for monomerid = 10684
TargetCholinesterase(Homo sapiens (Human))
University of North Carolina At Chapel Hill
LigandPNGBDBM10684((-)-(3aS)-1,8-Dibenzyl-3a-methyl-1,2,3,3a,8,8a-hex...)
Affinity DataIC50:  8.10nM. Assay description: The cholinesterase assays were performed using colorimetric method reported by Ellman. The absorbance changes at 412 nm were recorded for 5 min with ...
In DepthDetails ArticlePubMed
TargetAcetylcholinesterase(Homo sapiens (Human))
University of North Carolina At Chapel Hill
LigandPNGBDBM10684((-)-(3aS)-1,8-Dibenzyl-3a-methyl-1,2,3,3a,8,8a-hex...)
Affinity DataIC50:  1.09E+3nMpH: 8.0 T: 2°C. Assay description: The cholinesterase assays were performed using colorimetric method reported by Ellman. The absorbance changes at 412 nm were recorded for 5 min with ...
In DepthDetails ArticlePubMed